Target
Lysosomal acid glucosylceramidase
Ligand
BDBM42289
Substrate
Meas. Tech.
Dose response cell-based high throughput screening assay to identify enhancers of beta-glucosidase activity
EC50
>10000±n/a nM
Citation
 PubChem, PC Dose response cell-based high throughput screening assay to identify enhancers of beta-glucosidase activity PubChem Bioassay (2008)[AID] 
Target
Name:
Lysosomal acid glucosylceramidase
Synonyms:
Acid beta-glucosidase Beta-glucocerebrosidase D-glucosyl-N-acylsphingosine glucohydrolase GBA1 GC GLUC Glucosylceramidase (GBA) Glucosylceramidase precursor (Beta-glucocerebrosidase) (Acid beta-glucosidase) (D-glucosyl-N-acylsphingosine glucohydrolase) (Alglucerase) (Imiglucerase) beta-glucocerebrosidase (GCase)
Type:
Enzyme
Mol. Mass.:
59724.64
Organism:
Homo sapiens (Human)
Description:
The beta-Glu activity was measured with commercially available beta-glucocerebrosidase (Ceredase) as the enzyme source.
Residue:
536
  
Inhibitor
Name:
BDBM42289
Synonyms:
1-(4-Methoxy-benzyl)-3,3-dimethyl-1-(8-methyl-2-oxo-1,2-dihydro-quinolin-3-ylmethyl)-urea 1-[(4-methoxyphenyl)methyl]-3,3-dimethyl-1-[(8-methyl-2-oxidanylidene-1H-quinolin-3-yl)methyl]urea MLS000074000 cid_654410
Type:
Small organic molecule
Emp. Form.:
C22H25N3O3
Mol. Mass.:
379.4522
SMILES:
COc1ccc(CN(Cc2cc3cccc(C)c3[nH]c2=O)C(=O)N(C)C)cc1
: