Target
Lysosomal acid glucosylceramidase
Ligand
BDBM42318
Substrate
Meas. Tech.
Dose response cell-based high throughput screening assay to identify enhancers of beta-glucosidase activity
EC50
15890±n/a nM
Citation
 PubChem, PC Dose response cell-based high throughput screening assay to identify enhancers of beta-glucosidase activity PubChem Bioassay (2008)[AID] 
Target
Name:
Lysosomal acid glucosylceramidase
Synonyms:
Acid beta-glucosidase Beta-glucocerebrosidase D-glucosyl-N-acylsphingosine glucohydrolase GBA1 GC GLUC Glucosylceramidase (GBA) Glucosylceramidase precursor (Beta-glucocerebrosidase) (Acid beta-glucosidase) (D-glucosyl-N-acylsphingosine glucohydrolase) (Alglucerase) (Imiglucerase) beta-glucocerebrosidase (GCase)
Type:
Enzyme
Mol. Mass.:
59724.64
Organism:
Homo sapiens (Human)
Description:
The beta-Glu activity was measured with commercially available beta-glucocerebrosidase (Ceredase) as the enzyme source.
Residue:
536
  
Inhibitor
Name:
BDBM42318
Synonyms:
MLS000091920 N-[3-(4-ethylpiperazin-1-yl)propyl]-7-methoxy-furo[2,3-b]quinoline-2-carboxamide N-[3-(4-ethylpiperazino)propyl]-7-methoxy-furo[2,3-b]quinoline-2-carboxamide cid_3236194
Type:
Small organic molecule
Emp. Form.:
C22H28N4O3
Mol. Mass.:
396.4827
SMILES:
CCN1CCN(CCCNC(=O)c2cc3cc4ccc(OC)cc4nc3o2)CC1
: