Target
Lysosomal acid glucosylceramidase
Ligand
BDBM42370
Substrate
Meas. Tech.
Dose response cell-based high throughput screening assay to identify enhancers of beta-glucosidase activity
EC50
>10000±n/a nM
Citation
 PubChem, PC Dose response cell-based high throughput screening assay to identify enhancers of beta-glucosidase activity PubChem Bioassay (2008)[AID] 
Target
Name:
Lysosomal acid glucosylceramidase
Synonyms:
Acid beta-glucosidase Beta-glucocerebrosidase D-glucosyl-N-acylsphingosine glucohydrolase GBA1 GC GLUC Glucosylceramidase (GBA) Glucosylceramidase precursor (Beta-glucocerebrosidase) (Acid beta-glucosidase) (D-glucosyl-N-acylsphingosine glucohydrolase) (Alglucerase) (Imiglucerase) beta-glucocerebrosidase (GCase)
Type:
Enzyme
Mol. Mass.:
59724.64
Organism:
Homo sapiens (Human)
Description:
The beta-Glu activity was measured with commercially available beta-glucocerebrosidase (Ceredase) as the enzyme source.
Residue:
536
  
Inhibitor
Name:
BDBM42370
Synonyms:
8-ethoxy-N-(2-oxolanylmethyl)-5-quinolinesulfonamide 8-ethoxy-N-(tetrahydrofuran-2-ylmethyl)quinoline-5-sulfonamide MLS000086052 cid_3244767
Type:
Small organic molecule
Emp. Form.:
C16H20N2O4S
Mol. Mass.:
336.406
SMILES:
CCOc1ccc(c2cccnc12)S(=O)(=O)NCC1CCCO1
: