Target
Mitogen-activated protein kinase 10
Ligand
BDBM42783
Substrate
Meas. Tech.
Dose response biochemical screening assay for inhibitors of c-Jun N-Terminal Kinase 3 (JNK3)
IC50
42500±n/a nM
Citation
 PubChem, PC Dose response biochemical screening assay for inhibitors of c-Jun N-Terminal Kinase 3 (JNK3) PubChem Bioassay (2008)[AID] 
Target
Name:
Mitogen-activated protein kinase 10
Synonyms:
JNK3 MAP kinase p49 3F12 MK10_HUMAN Mitogen-activated protein kinase 10 (Stress-activated protein kinase JNK3) (c-Jun N-terminal kinase 3) (MAP kinase p49 3F12) PRKM10 Stress-activated protein kinase JNK3 | c-Jun N-terminal kinase 3 (JNK3)
Type:
Enzyme
Mol. Mass.:
52586.89
Organism:
Homo sapiens (Human)
Description:
Residue:
464
  
Inhibitor
Name:
BDBM42783
Synonyms:
MLS000065653 N-(3-carbamoyl-5,6-dihydro-4H-cyclopenta[b]thiophen-2-yl)-2-oxolanecarboxamide N-(3-carbamoyl-5,6-dihydro-4H-cyclopenta[b]thiophen-2-yl)tetrahydrofuran-2-carboxamide SMR000080296 | cid_2970466
Type:
Small organic molecule
Emp. Form.:
C13H16N2O3S
Mol. Mass.:
280.343
SMILES:
NC(=O)c1c(NC(=O)C2CCCO2)sc2CCCc12
: