Target
Nuclear receptor coactivator 1
Ligand
BDBM43161
Substrate
Meas. Tech.
Dose response biochemical High Throughput Screening assay for agonists of the steroid receptor coactivator 1 (SRC-1) recruitment by the peroxisome proliferator-activated receptor gamma (PPARgamma)
EC50
>79370±n/a nM
Citation
 PubChem, PC Dose response biochemical High Throughput Screening assay for agonists of the steroid receptor coactivator 1 (SRC-1) recruitment by the peroxisome proliferator-activated receptor gamma (PPARgamma) PubChem Bioassay (2008)[AID] 
Target
Name:
Nuclear receptor coactivator 1
Synonyms:
BHLHE74 NCOA1 NCoA-1 Protein Hin-2 Renal carcinoma antigen NY-REN-52 SRC1 nuclear receptor coactivator 1 isoform 1
Type:
PROTEIN
Mol. Mass.:
156749.34
Organism:
Homo sapiens (Human)
Description:
ChEMBL_759690
Residue:
1441
  
Inhibitor
Name:
BDBM43161
Synonyms:
MLS000681433 N-[4-[3-[(Z)-(2-acetamido-4-oxidanylidene-1,3-thiazol-5-ylidene)methyl]-2,5-dimethyl-pyrrol-1-yl]phenyl]ethanamide N-[4-[3-[(Z)-(2-acetamido-4-oxo-5-thiazolylidene)methyl]-2,5-dimethyl-1-pyrrolyl]phenyl]acetamide SMR000267816 | cid_1359423
Type:
Small organic molecule
Emp. Form.:
C20H20N4O3S
Mol. Mass.:
396.463
SMILES:
CC(=O)NC1=NC(=O)\C(S1)=C\c1cc(C)n(c1C)-c1ccc(NC(C)=O)cc1
: