Target
Apoptosis regulator Bcl-2
Ligand
BDBM33048
Substrate
Meas. Tech.
Multiplexed high-throughput screen for small molecule regulators of Bcl-2 family protein interactions, specifically Bim-Bcl-2
EC50
760±n/a nM
Citation
 PubChem, PC Multiplexed high-throughput screen for small molecule regulators of Bcl-2 family protein interactions, specifically Bim-Bcl-2 PubChem Bioassay (2008)[AID] 
Target
Name:
Apoptosis regulator Bcl-2
Synonyms:
Apoptosis regulator Bcl-2 Protein BCL-2 BCL2_HUMAN | Bcl-2 Protein
Type:
Homodimer or heterodimer
Mol. Mass.:
26269.11
Organism:
Homo sapiens (Human)
Description:
P10415
Residue:
239
  
Inhibitor
Name:
BDBM33048
Synonyms:
(5Z)-5-{[4-(dimethylamino)phenyl]imino}-1-(3-hydroxypropyl)-4-methyl-2,6-dioxo-1,2,5,6-tetrahydropyridine-3-carbonitrile 5-[4-(dimethylamino)phenyl]imino-1-(3-hydroxypropyl)-4-methyl-2,6-dioxo-3-pyridinecarbonitrile 5-[4-(dimethylamino)phenyl]imino-4-methyl-2,6-bis(oxidanylidene)-1-(3-oxidanylpropyl)pyridine-3-carbonitrile SMR000024616 | cid_3239318
Type:
Small organic molecule
Emp. Form.:
C18H20N4O3
Mol. Mass.:
340.3764
SMILES:
CN(C)c1ccc(cc1)\N=C1/C(C)=C(C#N)C(=O)N(CCCO)C1=O
: