Target
Induced myeloid leukemia cell differentiation protein Mcl-1
Ligand
BDBM32270
Substrate
Meas. Tech.
Multiplexed dose response screen for small molecule regulators of Bcl-2 family protein interactions, specifically Bim-Mcl-1.
EC50
1900±n/a nM
Citation
 PubChem, PC Multiplexed dose response screen for small molecule regulators of Bcl-2 family protein interactions, specifically Bim-Mcl-1. PubChem Bioassay (2008)[AID] 
Target
Name:
Induced myeloid leukemia cell differentiation protein Mcl-1
Synonyms:
BCL2L3 Bcl-2-like protein 3 (Mcl-1) Bcl2-L-3 MCL1 Mcl-1 Myeloid cell leukemia sequence 1 (BCL2-related) | mcl1/EAT
Type:
Membrane; Single-pass membrane protein
Mol. Mass.:
37332.87
Organism:
Homo sapiens (Human)
Description:
Q07820
Residue:
350
  
Inhibitor
Name:
BDBM32270
Synonyms:
6,7-dimethoxy-4-(2-oxolanylmethylamino)-1H-quinazoline-2-thione 6,7-dimethoxy-4-(tetrahydrofurfurylamino)-1H-quinazoline-2-thione MLS000045008 cid_3243470
Type:
Small organic molecule
Emp. Form.:
C15H19N3O3S
Mol. Mass.:
321.395
SMILES:
COc1cc2nc(=S)[nH]c(NCC3CCCO3)c2cc1OC
: