Target
Induced myeloid leukemia cell differentiation protein Mcl-1
Ligand
BDBM33057
Substrate
Meas. Tech.
Multiplexed dose response screen for small molecule regulators of Bcl-2 family protein interactions, specifically Bim-Mcl-1.
EC50
1750±n/a nM
Citation
 PubChem, PC Multiplexed dose response screen for small molecule regulators of Bcl-2 family protein interactions, specifically Bim-Mcl-1. PubChem Bioassay (2008)[AID] 
Target
Name:
Induced myeloid leukemia cell differentiation protein Mcl-1
Synonyms:
BCL2L3 Bcl-2-like protein 3 (Mcl-1) Bcl2-L-3 MCL1 Mcl-1 Myeloid cell leukemia sequence 1 (BCL2-related) | mcl1/EAT
Type:
Membrane; Single-pass membrane protein
Mol. Mass.:
37332.87
Organism:
Homo sapiens (Human)
Description:
Q07820
Residue:
350
  
Inhibitor
Name:
BDBM33057
Synonyms:
6-methyl-2-(1-naphthalenyl)-5-benzotriazolamine 6-methyl-2-naphthalen-1-yl-benzotriazol-5-amine MLS000064228 [6-methyl-2-(1-naphthyl)benzotriazol-5-yl]amine | cid_938026
Type:
Small organic molecule
Emp. Form.:
C17H14N4
Mol. Mass.:
274.3199
SMILES:
Cc1cc2nn(nc2cc1N)-c1cccc2ccccc12
: