Target
Induced myeloid leukemia cell differentiation protein Mcl-1
Ligand
BDBM32294
Substrate
Meas. Tech.
Multiplexed dose response screen for small molecule regulators of Bcl-2 family protein interactions, specifically Bim-Mcl-1.
EC50
5530±n/a nM
Citation
 PubChem, PC Multiplexed dose response screen for small molecule regulators of Bcl-2 family protein interactions, specifically Bim-Mcl-1. PubChem Bioassay (2008)[AID] 
Target
Name:
Induced myeloid leukemia cell differentiation protein Mcl-1
Synonyms:
BCL2L3 Bcl-2-like protein 3 (Mcl-1) Bcl2-L-3 MCL1 Mcl-1 Myeloid cell leukemia sequence 1 (BCL2-related) | mcl1/EAT
Type:
Membrane; Single-pass membrane protein
Mol. Mass.:
37332.87
Organism:
Homo sapiens (Human)
Description:
Q07820
Residue:
350
  
Inhibitor
Name:
BDBM32294
Synonyms:
(1,1-diketo-1,2-benzothiazol-3-yl)-methyl-[[(E)-3-phenylprop-2-enylidene]amino]amine MLS000585612 N-methyl-1,1-dioxo-N-[[(E)-3-phenylprop-2-enylidene]amino]-1,2-benzothiazol-3-amine cid_12004606
Type:
Small organic molecule
Emp. Form.:
C17H15N3O2S
Mol. Mass.:
325.385
SMILES:
CN(N=C\C=C\c1ccccc1)C1=NS(=O)(=O)c2ccccc12
: