Target
Induced myeloid leukemia cell differentiation protein Mcl-1
Ligand
BDBM32327
Substrate
Meas. Tech.
Multiplexed dose response screen for small molecule regulators of Bcl-2 family protein interactions, specifically Bim-Mcl-1.
EC50
6140±n/a nM
Citation
 PubChem, PC Multiplexed dose response screen for small molecule regulators of Bcl-2 family protein interactions, specifically Bim-Mcl-1. PubChem Bioassay (2008)[AID] 
Target
Name:
Induced myeloid leukemia cell differentiation protein Mcl-1
Synonyms:
BCL2L3 Bcl-2-like protein 3 (Mcl-1) Bcl2-L-3 MCL1 Mcl-1 Myeloid cell leukemia sequence 1 (BCL2-related) | mcl1/EAT
Type:
Membrane; Single-pass membrane protein
Mol. Mass.:
37332.87
Organism:
Homo sapiens (Human)
Description:
Q07820
Residue:
350
  
Inhibitor
Name:
BDBM32327
Synonyms:
4-amino-6,7-dimethoxy-3-(3-morpholin-4-ylpropyl)quinazoline-2-thione 4-amino-6,7-dimethoxy-3-[3-(4-morpholinyl)propyl]-2-quinazolinethione 4-imino-6,7-dimethoxy-3-(3-morpholinopropyl)-3,4-dihydro-2(1H)-quinazolinethione SMR000336049 | cid_1482788
Type:
Small organic molecule
Emp. Form.:
C17H24N4O3S
Mol. Mass.:
364.462
SMILES:
COc1cc2nc(=S)n(CCCN3CCOCC3)c(N)c2cc1OC
: