Target
Induced myeloid leukemia cell differentiation protein Mcl-1
Ligand
BDBM32330
Substrate
Meas. Tech.
Multiplexed dose response screen for small molecule regulators of Bcl-2 family protein interactions, specifically Bim-Mcl-1.
EC50
3830±n/a nM
Citation
 PubChem, PC Multiplexed dose response screen for small molecule regulators of Bcl-2 family protein interactions, specifically Bim-Mcl-1. PubChem Bioassay (2008)[AID] 
Target
Name:
Induced myeloid leukemia cell differentiation protein Mcl-1
Synonyms:
BCL2L3 Bcl-2-like protein 3 (Mcl-1) Bcl2-L-3 MCL1 Mcl-1 Myeloid cell leukemia sequence 1 (BCL2-related) | mcl1/EAT
Type:
Membrane; Single-pass membrane protein
Mol. Mass.:
37332.87
Organism:
Homo sapiens (Human)
Description:
Q07820
Residue:
350
  
Inhibitor
Name:
BDBM32330
Synonyms:
(2Z)-2-(5-fluoranyl-2-oxidanylidene-indol-3-yl)-2-(4-methyl-3H-1,3-thiazol-2-ylidene)ethanenitrile (2Z)-2-(5-fluoro-2-oxo-3-indolyl)-2-(4-methyl-3H-thiazol-2-ylidene)acetonitrile MLS001011168 cid_16196155
Type:
Small organic molecule
Emp. Form.:
C14H8FN3OS
Mol. Mass.:
285.296
SMILES:
Cc1csc(n1)C(C#N)=C1C(=O)Nc2ccc(F)cc12
: