Target
E3 ubiquitin-protein ligase Mdm2
Ligand
BDBM43348
Substrate
Meas. Tech.
E3 Ligase dose-response_384
EC50
560±n/a nM
Citation
 PubChem, PC E3 Ligase dose-response_384 PubChem Bioassay (2008)[AID] 
Target
Name:
E3 ubiquitin-protein ligase Mdm2
Synonyms:
Double minute 2 protein E3 ubiquitin-protein ligase Mdm2 (p53-binding protein Mdm2) Human Double Minute 2 (HDM2) MDM2-MDMX p53-Binding Protein MDM2 | p53-binding protein
Type:
Oncoprotein
Mol. Mass.:
55196.54
Organism:
Homo sapiens (Human)
Description:
Q00987
Residue:
491
  
Inhibitor
Name:
BDBM43348
Synonyms:
6-(methoxymethyl)-2-[(6-methyl-1,3-benzoxazol-2-yl)amino]-1H-pyrimidin-4-one SMR000040429 | cid_659383
Type:
Small organic molecule
Emp. Form.:
C14H14N4O3
Mol. Mass.:
286.286
SMILES:
COCc1cc(=O)[nH]c(Nc2nc3ccc(C)cc3o2)n1
: