Target
G2/mitotic-specific cyclin-B1
Ligand
BDBM43775
Substrate
Meas. Tech.
Counterscreen assay for inhibitors of Wee1 degradation: dose response cell-based assay to identify inhibitors of cyclin B degradation
EC50
>49750±n/a nM
Citation
 PubChem, PC Counterscreen assay for inhibitors of Wee1 degradation: dose response cell-based assay to identify inhibitors of cyclin B degradation PubChem Bioassay (2008)[AID] 
Target
Name:
G2/mitotic-specific cyclin-B1
Synonyms:
CCNB CCNB1_HUMAN
Type:
Enzyme Subunit
Mol. Mass.:
48340.95
Organism:
Homo sapiens (Human)
Description:
P14635
Residue:
433
  
Inhibitor
Name:
BDBM43775
Synonyms:
2,3-Dihydro-benzo[1,4]dioxine-6-carboxylic acid [1-(5-methyl-thiophen-2-yl)-meth-(E)-ylidene]-hydrazide N-[(5-methyl-2-thienyl)methyleneamino]-2,3-dihydro-1,4-benzodioxin-6-carboxamide N-[(5-methylthiophen-2-yl)methylideneamino]-2,3-dihydro-1,4-benzodioxine-6-carboxamide cid_919304
Type:
Small organic molecule
Emp. Form.:
C15H14N2O3S
Mol. Mass.:
302.348
SMILES:
Cc1ccc(C=NNC(=O)c2ccc3OCCOc3c2)s1
: