Target
Gag-Pol polyprotein [600-1027,R876K]/[600-1155]
Ligand
BDBM2007
Substrate
poly(rC):oligo(dG)
Meas. Tech.
HIV-1 RT Assay
IC50
132±n/a nM
Citation
 Klunder, JMHargrave, KDWest, MCullen, EPal, KBehnke, MLKapadia, SRMcNeil, DWWu, JCChow, GC Novel non-nucleoside inhibitors of HIV-1 reverse transcriptase. 2. Tricyclic pyridobenzoxazepinones and dibenzoxazepinones. J Med Chem 35:1887-97 (1992)  
Target
Name:
Gag-Pol polyprotein [600-1027,R876K]/[600-1155]
Synonyms:
EC: 2.7.7.49 | HIV-1 Reverse Transcriptase
Type:
Protein Complex
Mol. Mass.:
113858
Description:
Components:
This complex has 2 components.
Component 1
Name:
Gag-Pol polyprotein [600-1155]
Synonyms:
HIV-1 Reverse Transcriptase Chain A gag-pol
Type:
Enzyme Subunit
Mol. Mass.:
63928.81
Organism:
Human immunodeficiency virus type 1
Description:
P03366[600-1155]
Residue:
556
  
Component 2
Name:
Gag-Pol polyprotein [600-1027,R876K]
Synonyms:
HIV-1 Reverse Transcriptase Chain B gag-pol
Type:
Enzyme Subunit
Mol. Mass.:
49968.63
Organism:
Human immunodeficiency virus type 1
Description:
P03366[600-1027,R876K]
Residue:
428
  
Inhibitor
Name:
BDBM2007
Synonyms:
12-amino-10-ethyl-14-methyl-2-oxa-4,10-diazatricyclo[9.4.0.0^{3,8}]pentadeca-1(15),3,5,7,11,13-hexaen-9-one | Pyridobenzoxazepinone 75
Type:
Small organic molecule
Emp. Form.:
C15H15N3O2
Mol. Mass.:
269.2985
SMILES:
CCN1c2c(N)cc(C)cc2Oc2ncccc2C1=O
:
Substrate
Name:
poly(rC):oligo(dG)
Synonyms:
Type:
RNA-DNA duplex
Mol. Mass.:
358.43
Organism:
Description:
The incorporation of Tritium-labeled [3H]dGTP onto a (poly)rC:(oligo)dG template:primer.
Residue:
3
NA