Target
Solute carrier family 12 member 5
Ligand
BDBM44056
Substrate
Meas. Tech.
Identification of Novel Modulators of Cl- dependent Transport Process via HTS; Dose-dependent Assay with KCC2
EC50
771000±n/a nM
Citation
 PubChem, PC Identification of Novel Modulators of Cl- dependent Transport Process via HTS; Dose-dependent Assay with KCC2 PubChem Bioassay (2009)[AID] 
Target
Name:
Solute carrier family 12 member 5
Synonyms:
Electroneutral potassium-chloride cotransporter 2 KCC2 Neuronal K-Cl cotransporter SLC12A5 electroneutral potassium-chloride cotransporter KCC2 | hKCC2
Type:
PROTEIN
Mol. Mass.:
126185.18
Organism:
Homo sapiens (Human)
Description:
ChEMBL_828024
Residue:
1139
  
Inhibitor
Name:
BDBM44056
Synonyms:
1-(4-methoxyphenyl)-4-(3-methylanilino)-1,3-diazaspiro[4.5]dec-3-ene-2-thione 1-(4-methoxyphenyl)-4-[(3-methylphenyl)amino]-1,3-diazaspiro[4.5]dec-3-ene-2-thione MLS000700207 cid_1041226
Type:
Small organic molecule
Emp. Form.:
C22H25N3OS
Mol. Mass.:
379.518
SMILES:
COc1ccc(cc1)N1C(=S)N=C(Nc2cccc(C)c2)C11CCCCC1
: