Target
Multidrug resistance-associated protein 1
Ligand
BDBM44572
Substrate
Meas. Tech.
Identification of Molecular Probes that Activate MRP-1 - Dose Response
EC50
603±n/a nM
Citation
 PubChem, PC Identification of Molecular Probes that Activate MRP-1 - Dose Response PubChem Bioassay (2007)[AID] 
Target
Name:
Multidrug resistance-associated protein 1
Synonyms:
7.6.2.2 ABCC1 ATP-binding cassette, sub-family C, member 1 isoform 1 LTC4 transporter MRP MRP1_HUMAN
Type:
Mol. Mass.:
171597.72
Organism:
Homo sapiens (Human)
Description:
P33527
Residue:
1531
  
Inhibitor
Name:
BDBM44572
Synonyms:
3-(phenylmethyl)-5-[1-(phenylsulfonyl)piperidin-3-yl]-2H-[1,2,3]triazolo[4,5-d]pyrimidin-7-one 5-(1-Benzenesulfonyl-piperidin-3-yl)-3-benzyl-3H-[1,2,3]triazolo[4,5-d]pyrimidin-7-ol 5-[1-(benzenesulfonyl)piperidin-3-yl]-3-benzyl-2H-triazolo[4,5-d]pyrimidin-7-one SMR000007417 | cid_652359
Type:
Small organic molecule
Emp. Form.:
C22H22N6O3S
Mol. Mass.:
450.513
SMILES:
O=c1[nH]c(nc2n(Cc3ccccc3)nnc12)C1CCCN(C1)S(=O)(=O)c1ccccc1
: