Target
Multidrug resistance-associated protein 1
Ligand
BDBM33053
Substrate
Meas. Tech.
Identification of Molecular Probes that Activate MRP-1 - Dose Response
EC50
<195±n/a nM
Citation
 PubChem, PC Identification of Molecular Probes that Activate MRP-1 - Dose Response PubChem Bioassay (2007)[AID] 
Target
Name:
Multidrug resistance-associated protein 1
Synonyms:
7.6.2.2 ABCC1 ATP-binding cassette, sub-family C, member 1 isoform 1 LTC4 transporter MRP MRP1_HUMAN
Type:
Mol. Mass.:
171597.72
Organism:
Homo sapiens (Human)
Description:
P33527
Residue:
1531
  
Inhibitor
Name:
BDBM33053
Synonyms:
4-(2,3-dihydro-1H-perimidin-2-yl)-2,6-dimethoxy-phenol MLS000088499 cid_761640
Type:
Small organic molecule
Emp. Form.:
C19H18N2O3
Mol. Mass.:
322.3578
SMILES:
COc1cc(cc(OC)c1O)C1Nc2cccc3cccc(N1)c23
: