Target
Multidrug resistance-associated protein 1
Ligand
BDBM44983
Substrate
Meas. Tech.
Identification of Molecular Probes that Activate MRP-1 - Dose Response
EC50
694±n/a nM
Citation
 PubChem, PC Identification of Molecular Probes that Activate MRP-1 - Dose Response PubChem Bioassay (2007)[AID] 
Target
Name:
Multidrug resistance-associated protein 1
Synonyms:
7.6.2.2 ABCC1 ATP-binding cassette, sub-family C, member 1 isoform 1 LTC4 transporter MRP MRP1_HUMAN
Type:
Mol. Mass.:
171597.72
Organism:
Homo sapiens (Human)
Description:
P33527
Residue:
1531
  
Inhibitor
Name:
BDBM44983
Synonyms:
4-(1-oxoheptylamino)-N-(3-pyridinylmethylideneamino)benzamide 4-(heptanoylamino)-N-(pyridin-3-ylmethylideneamino)benzamide N-(4-{[2-(3-pyridinylmethylene)hydrazino]carbonyl}phenyl)heptanamide cid_5071792
Type:
Small organic molecule
Emp. Form.:
C20H24N4O2
Mol. Mass.:
352.4302
SMILES:
CCCCCCC(=O)Nc1ccc(cc1)C(=O)NN=Cc1cccnc1
: