Target
Coagulation factor XII
Ligand
BDBM33783
Substrate
Meas. Tech.
Factor XIIa 1536 HTS Dose Response Confirmation
IC50
>50000±0 nM
Citation
 PubChem, PC Factor XIIa 1536 HTS Dose Response Confirmation PubChem Bioassay (2008)[AID] 
Target
Name:
Coagulation factor XII
Synonyms:
Beta-factor XIIa part 1 Carboxylesterase 2 (intestine, liver) Coagulation factor XII (FXII) Coagulation factor XIIa light chain FA12_HUMAN Factor XIIa (fXIIa) Hageman factor
Type:
Enzyme
Mol. Mass.:
67810.07
Organism:
Homo sapiens (Human)
Description:
P00748
Residue:
615
  
Inhibitor
Name:
BDBM33783
Synonyms:
1-[(1-ethyl-2-methyl-benzimidazol-5-yl)carbonylamino]-3-(4-methylphenyl)thiourea 1-[(1-ethyl-2-methylbenzimidazole-5-carbonyl)amino]-3-(4-methylphenyl)thiourea MLS000402364 cid_2328617
Type:
Small organic molecule
Emp. Form.:
C19H21N5OS
Mol. Mass.:
367.468
SMILES:
CCn1c(C)nc2cc(ccc12)C(=O)NNC(=S)Nc1ccc(C)cc1
: