Target
Alkaline phosphatase, tissue-nonspecific isozyme
Ligand
BDBM41867
Substrate
Meas. Tech.
SAR analysis of an In Vitro TNAP Dose Response Luminescent Assay
IC50
3870±n/a nM
Citation
 PubChem, PC SAR analysis of an In Vitro TNAP Dose Response Luminescent Assay PubChem Bioassay (2010)[AID] 
Target
Name:
Alkaline phosphatase, tissue-nonspecific isozyme
Synonyms:
ALPL tissue-nonspecific alkaline phosphatase precursor
Type:
PROTEIN
Mol. Mass.:
57306.17
Organism:
Homo sapiens (Human)
Description:
ChEMBL_1448917
Residue:
524
  
Inhibitor
Name:
BDBM41867
Synonyms:
5-(1-naphthalenyl)-1,2-dihydropyrazol-3-one 5-naphthalen-1-yl-1,2-dihydropyrazol-3-one cid_610864
Type:
Small organic molecule
Emp. Form.:
C13H10N2O
Mol. Mass.:
210.2313
SMILES:
O=c1cc([nH][nH]1)-c1cccc2ccccc12
: