Target
Alkaline phosphatase, tissue-nonspecific isozyme
Ligand
BDBM12370
Substrate
Meas. Tech.
SAR analysis of an In Vitro TNAP Dose Response Luminescent Assay
IC50
>100000±n/a nM
Citation
 PubChem, PC SAR analysis of an In Vitro TNAP Dose Response Luminescent Assay PubChem Bioassay (2010)[AID] 
Target
Name:
Alkaline phosphatase, tissue-nonspecific isozyme
Synonyms:
ALPL tissue-nonspecific alkaline phosphatase precursor
Type:
PROTEIN
Mol. Mass.:
57306.17
Organism:
Homo sapiens (Human)
Description:
ChEMBL_1448917
Residue:
524
  
Inhibitor
Name:
BDBM12370
Synonyms:
(3-(Pyridin-3-yl)-1H-pyrazol-5-yl)methanamine [3-(pyridin-3-yl)-1H-pyrazol-5-yl]methanamine | nicotine 3-heteroaromatic analogue 32
Type:
Small organic molecule
Emp. Form.:
C9H10N4
Mol. Mass.:
174.2025
SMILES:
NCc1cc(n[nH]1)-c1cccnc1
: