Target
Alkaline phosphatase, tissue-nonspecific isozyme
Ligand
BDBM50254411
Substrate
Meas. Tech.
SAR analysis of an In Vitro TNAP Dose Response Luminescent Assay
IC50
100±n/a nM
Citation
 PubChem, PC SAR analysis of an In Vitro TNAP Dose Response Luminescent Assay PubChem Bioassay (2010)[AID] 
Target
Name:
Alkaline phosphatase, tissue-nonspecific isozyme
Synonyms:
ALPL tissue-nonspecific alkaline phosphatase precursor
Type:
PROTEIN
Mol. Mass.:
57306.17
Organism:
Homo sapiens (Human)
Description:
ChEMBL_1448917
Residue:
524
  
Inhibitor
Name:
BDBM50254411
Synonyms:
3-(2,4-dichloro-5-fluorophenyl)-N-(2-hydroxyethyl)-1H-pyrazole-5-carboxamide cid_24178141
Type:
Small organic molecule
Emp. Form.:
C12H10Cl2FN3O2
Mol. Mass.:
318.131
SMILES:
OCCNC(=O)c1cc(n[nH]1)-c1cc(F)c(Cl)cc1Cl
: