Target
Alkaline phosphatase, tissue-nonspecific isozyme
Ligand
BDBM50254417
Substrate
Meas. Tech.
SAR analysis of an In Vitro TNAP Dose Response Luminescent Assay
IC50
46.4±n/a nM
Citation
 PubChem, PC SAR analysis of an In Vitro TNAP Dose Response Luminescent Assay PubChem Bioassay (2010)[AID] 
Target
Name:
Alkaline phosphatase, tissue-nonspecific isozyme
Synonyms:
ALPL tissue-nonspecific alkaline phosphatase precursor
Type:
PROTEIN
Mol. Mass.:
57306.17
Organism:
Homo sapiens (Human)
Description:
ChEMBL_1448917
Residue:
524
  
Inhibitor
Name:
BDBM50254417
Synonyms:
3-(2,4-dichlorophenyl)-N-(2-methoxyethyl)-1H-pyrazole-5-carboxamide cid_19510137
Type:
Small organic molecule
Emp. Form.:
C13H13Cl2N3O2
Mol. Mass.:
314.167
SMILES:
COCCNC(=O)c1cc(n[nH]1)-c1ccc(Cl)cc1Cl
: