Target
Tyrosine-protein phosphatase non-receptor type 7
Ligand
BDBM46141
Substrate
Meas. Tech.
Fluorescent secondary assay for dose-response confirmation of chemical inhibitors of HePTP
IC50
22200±n/a nM
Citation
 PubChem, PC Fluorescent secondary assay for dose-response confirmation of chemical inhibitors of HePTP PubChem Bioassay (2009)[AID] 
Target
Name:
Tyrosine-protein phosphatase non-receptor type 7
Synonyms:
He-PTP Hematopoietic protein-tyrosine phosphatase (HEPTP) PTPN7 Tyrosine-protein phosphatase non-receptor type 7 | Tyrosine-protein phosphatase non-receptor type 7 (HEPTP)
Type:
Protein
Mol. Mass.:
40530.79
Organism:
Homo sapiens (Human)
Description:
P35236
Residue:
360
  
Inhibitor
Name:
BDBM46141
Synonyms:
1-(2-furanylmethyl)-1,3-diazinane-2,4,6-trione 1-(furan-2-ylmethyl)-1,3-diazinane-2,4,6-trione cid_2269367
Type:
Small organic molecule
Emp. Form.:
C9H8N2O4
Mol. Mass.:
208.1708
SMILES:
O=C1CC(=O)N(Cc2ccco2)C(=O)N1
: