Target
Nuclear receptor coactivator 2
Ligand
BDBM42967
Substrate
Meas. Tech.
Dose response biochemical High Throughput Screening assay for agonists of the steroid receptor coactivator 2 (SRC-2) recruitment by the peroxisome proliferator-activated receptor gamma (PPARgamma)
EC50
18280±n/a nM
Citation
 PubChem, PC Dose response biochemical High Throughput Screening assay for agonists of the steroid receptor coactivator 2 (SRC-2) recruitment by the peroxisome proliferator-activated receptor gamma (PPARgamma) PubChem Bioassay (2008)[AID] 
Target
Name:
Nuclear receptor coactivator 2
Synonyms:
BHLHE75 NCOA2 protein SRC2 | TIF2
Type:
Enzyme Catalytic Domain
Mol. Mass.:
159156.93
Organism:
Homo sapiens (Human)
Description:
Q15596
Residue:
1464
  
Inhibitor
Name:
BDBM42967
Synonyms:
2-(4-benzofuro[3,2-d]pyrimidinylthio)-N-(5-ethyl-1,3,4-thiadiazol-2-yl)acetamide 2-([1]benzofuro[3,2-d]pyrimidin-4-ylsulfanyl)-N-(5-ethyl-1,3,4-thiadiazol-2-yl)ethanamide MLS000101477 cid_2054017
Type:
Small organic molecule
Emp. Form.:
C16H13N5O2S2
Mol. Mass.:
371.437
SMILES:
CCc1nnc(NC(=O)CSc2ncnc3c4ccccc4oc23)s1
: