Target
Nuclear receptor coactivator 2
Ligand
BDBM43062
Substrate
Meas. Tech.
Dose response biochemical High Throughput Screening assay for agonists of the steroid receptor coactivator 2 (SRC-2) recruitment by the peroxisome proliferator-activated receptor gamma (PPARgamma)
EC50
11640±n/a nM
Citation
 PubChem, PC Dose response biochemical High Throughput Screening assay for agonists of the steroid receptor coactivator 2 (SRC-2) recruitment by the peroxisome proliferator-activated receptor gamma (PPARgamma) PubChem Bioassay (2008)[AID] 
Target
Name:
Nuclear receptor coactivator 2
Synonyms:
BHLHE75 NCOA2 protein SRC2 | TIF2
Type:
Enzyme Catalytic Domain
Mol. Mass.:
159156.93
Organism:
Homo sapiens (Human)
Description:
Q15596
Residue:
1464
  
Inhibitor
Name:
BDBM43062
Synonyms:
2-(3-Cyano-6-methyl-quinolin-2-ylsulfanyl)-N-thiophen-2-ylmethyl-acetamide 2-(3-cyano-6-methylquinolin-2-yl)sulfanyl-N-(thiophen-2-ylmethyl)acetamide 2-[(3-cyano-6-methyl-2-quinolyl)thio]-N-(2-thenyl)acetamide SMR000173141 | cid_3207506
Type:
Small organic molecule
Emp. Form.:
C18H15N3OS2
Mol. Mass.:
353.461
SMILES:
Cc1ccc2nc(SCC(=O)NCc3cccs3)c(cc2c1)C#N
: