Target
Nuclear receptor coactivator 2
Ligand
BDBM43066
Substrate
Meas. Tech.
Dose response biochemical High Throughput Screening assay for agonists of the steroid receptor coactivator 2 (SRC-2) recruitment by the peroxisome proliferator-activated receptor gamma (PPARgamma)
EC50
14820±n/a nM
Citation
 PubChem, PC Dose response biochemical High Throughput Screening assay for agonists of the steroid receptor coactivator 2 (SRC-2) recruitment by the peroxisome proliferator-activated receptor gamma (PPARgamma) PubChem Bioassay (2008)[AID] 
Target
Name:
Nuclear receptor coactivator 2
Synonyms:
BHLHE75 NCOA2 protein SRC2 | TIF2
Type:
Enzyme Catalytic Domain
Mol. Mass.:
159156.93
Organism:
Homo sapiens (Human)
Description:
Q15596
Residue:
1464
  
Inhibitor
Name:
BDBM43066
Synonyms:
4-[[4-(4-chlorophenyl)-3-cyano-6-phenyl-2-pyridinyl]thio]-3-oxobutanoic acid ethyl ester MLS000581826 cid_2216871 ethyl 4-[4-(4-chlorophenyl)-3-cyano-6-phenylpyridin-2-yl]sulfanyl-3-oxobutanoate | ethyl 4-{[4-(4-chlorophenyl)-3-cyano-6-phenyl-2-pyridinyl]thio}-3-oxobutanoate
Type:
Small organic molecule
Emp. Form.:
C24H19ClN2O3S
Mol. Mass.:
450.937
SMILES:
CCOC(=O)CC(=O)CSc1nc(cc(-c2ccc(Cl)cc2)c1C#N)-c1ccccc1
: