Target
Nuclear receptor coactivator 2
Ligand
BDBM43091
Substrate
Meas. Tech.
Dose response biochemical High Throughput Screening assay for agonists of the steroid receptor coactivator 2 (SRC-2) recruitment by the peroxisome proliferator-activated receptor gamma (PPARgamma)
EC50
7961±n/a nM
Citation
 PubChem, PC Dose response biochemical High Throughput Screening assay for agonists of the steroid receptor coactivator 2 (SRC-2) recruitment by the peroxisome proliferator-activated receptor gamma (PPARgamma) PubChem Bioassay (2008)[AID] 
Target
Name:
Nuclear receptor coactivator 2
Synonyms:
BHLHE75 NCOA2 protein SRC2 | TIF2
Type:
Enzyme Catalytic Domain
Mol. Mass.:
159156.93
Organism:
Homo sapiens (Human)
Description:
Q15596
Residue:
1464
  
Inhibitor
Name:
BDBM43091
Synonyms:
2-[2-(3-chlorobenzothiophene-2-carbonyl)imino-6-sulfamoyl-1,3-benzothiazol-3-yl]acetic acid ethyl ester MLS000697082 cid_4625720 ethyl 2-[2-[(3-chloranyl-1-benzothiophen-2-yl)carbonylimino]-6-sulfamoyl-1,3-benzothiazol-3-yl]ethanoate
Type:
Small organic molecule
Emp. Form.:
C20H16ClN3O5S3
Mol. Mass.:
510.006
SMILES:
CCOC(=O)Cn1c2ccc(cc2s\c1=N/C(=O)c1sc2ccccc2c1Cl)S(N)(=O)=O
: