Target
Nuclear receptor coactivator 2
Ligand
BDBM43160
Substrate
Meas. Tech.
Dose response biochemical High Throughput Screening assay for agonists of the steroid receptor coactivator 2 (SRC-2) recruitment by the peroxisome proliferator-activated receptor gamma (PPARgamma)
EC50
17770±n/a nM
Citation
 PubChem, PC Dose response biochemical High Throughput Screening assay for agonists of the steroid receptor coactivator 2 (SRC-2) recruitment by the peroxisome proliferator-activated receptor gamma (PPARgamma) PubChem Bioassay (2008)[AID] 
Target
Name:
Nuclear receptor coactivator 2
Synonyms:
BHLHE75 NCOA2 protein SRC2 | TIF2
Type:
Enzyme Catalytic Domain
Mol. Mass.:
159156.93
Organism:
Homo sapiens (Human)
Description:
Q15596
Residue:
1464
  
Inhibitor
Name:
BDBM43160
Synonyms:
1-(1,3-benzodioxol-5-ylmethyl)-3-(2,1,3-benzothiadiazol-5-yl)urea MLS000677397 cid_778346
Type:
Small organic molecule
Emp. Form.:
C15H12N4O3S
Mol. Mass.:
328.346
SMILES:
O=C(NCc1ccc2OCOc2c1)Nc1ccc2nsnc2c1
: