Target
Bcl-2-like protein 10 [11-204]
Ligand
BDBM46296
Substrate
Meas. Tech.
Multiplexed high-throughput screen for small molecule regulators of Bcl-2 family protein interactions, specifically Bim-Bcl-B protein.
EC50
820±n/a nM
Citation
 PubChem, PC Multiplexed high-throughput screen for small molecule regulators of Bcl-2 family protein interactions, specifically Bim-Bcl-B protein. PubChem Bioassay (2008)[AID] 
Target
Name:
Bcl-2-like protein 10 [11-204]
Synonyms:
Apoptosis regulator Bcl-B (Bcl-2-like 10 protein) (Bcl2-L-10) (Anti-apoptotic protein NrH). BCL-B BCLB DIVA
Type:
Enzyme Catalytic Domain
Mol. Mass.:
21981.77
Organism:
Homo sapiens (Human)
Description:
gi_23396469
Residue:
194
  
Inhibitor
Name:
BDBM46296
Synonyms:
(2-methoxyphenyl)-[4-(2-methylimidazo[1,2-a]pyrimidin-3-yl)thiazol-2-yl]amine;hydrobromide N-(2-methoxyphenyl)-4-(2-methyl-3-imidazo[1,2-a]pyrimidinyl)-2-thiazolamine;hydrobromide SMR000288807 | cid_2877735
Type:
Small organic molecule
Emp. Form.:
C17H15N5OS
Mol. Mass.:
337.399
SMILES:
COc1ccccc1Nc1nc(cs1)-c1c(C)nc2ncccn12
: