Target
Bcl-2-like protein 2
Ligand
BDBM33066
Substrate
Meas. Tech.
Multiplexed dose response screen for small molecule regulators of Bcl-2 family protein interactions, specifically Bim-Bcl-W.
EC50
50±n/a nM
Citation
 PubChem, PC Multiplexed dose response screen for small molecule regulators of Bcl-2 family protein interactions, specifically Bim-Bcl-W. PubChem Bioassay (2008)[AID] 
Target
Name:
Bcl-2-like protein 2
Synonyms:
Apoptosis regulator Bcl-W BCL-W BCLW Bcl2-L-2 | KIAA0271
Type:
Protein
Mol. Mass.:
20742.61
Organism:
Homo sapiens (Human)
Description:
Residue:
193
  
Inhibitor
Name:
BDBM33066
Synonyms:
2,5-bis(chloranyl)-3-[2-(dimethylamino)-1,3-thiazol-5-yl]-6-pyrrolidin-1-yl-cyclohexa-2,5-diene-1,4-dione 2,5-dichloro-3-[2-(dimethylamino)-1,3-thiazol-5-yl]-6-pyrrolidin-1-ylcyclohexa-2,5-diene-1,4-dione 2,5-dichloro-3-[2-(dimethylamino)thiazol-5-yl]-6-pyrrolidino-p-benzoquinone SMR000115102 | cid_1002248
Type:
Small organic molecule
Emp. Form.:
C15H15Cl2N3O2S
Mol. Mass.:
372.27
SMILES:
CN(C)c1ncc(s1)C1=C(Cl)C(=O)C(N2CCCC2)=C(Cl)C1=O
: