Target
Bcl-2-like protein 2
Ligand
BDBM33102
Substrate
Meas. Tech.
Multiplexed dose response screen for small molecule regulators of Bcl-2 family protein interactions, specifically Bim-Bcl-W.
EC50
920±n/a nM
Citation
 PubChem, PC Multiplexed dose response screen for small molecule regulators of Bcl-2 family protein interactions, specifically Bim-Bcl-W. PubChem Bioassay (2008)[AID] 
Target
Name:
Bcl-2-like protein 2
Synonyms:
Apoptosis regulator Bcl-W BCL-W BCLW Bcl2-L-2 | KIAA0271
Type:
Protein
Mol. Mass.:
20742.61
Organism:
Homo sapiens (Human)
Description:
Residue:
193
  
Inhibitor
Name:
BDBM33102
Synonyms:
MLS000571745 N-ethyl-N-(1-hydroxy-3,4-dioxo-2-naphthalenyl)propanamide N-ethyl-N-(3-hydroxy-1,4-dioxo-1,4-dihydro-2-naphthalenyl)propanamide SMR000193757 | cid_2879069
Type:
Small organic molecule
Emp. Form.:
C15H15NO4
Mol. Mass.:
273.2839
SMILES:
CCN(C1C(=O)C(=O)c2ccccc2C1=O)C(=O)CC
: