Target
Bcl-2-like protein 2
Ligand
BDBM32312
Substrate
Meas. Tech.
Multiplexed dose response screen for small molecule regulators of Bcl-2 family protein interactions, specifically Bim-Bcl-W.
EC50
3310±n/a nM
Citation
 PubChem, PC Multiplexed dose response screen for small molecule regulators of Bcl-2 family protein interactions, specifically Bim-Bcl-W. PubChem Bioassay (2008)[AID] 
Target
Name:
Bcl-2-like protein 2
Synonyms:
Apoptosis regulator Bcl-W BCL-W BCLW Bcl2-L-2 | KIAA0271
Type:
Protein
Mol. Mass.:
20742.61
Organism:
Homo sapiens (Human)
Description:
Residue:
193
  
Inhibitor
Name:
BDBM32312
Synonyms:
(2E,5E)-2,5-bis(4-hydroxy-3,5-dimethoxy-benzylidene)cyclopentanone (2E,5E)-2,5-bis[(4-hydroxy-3,5-dimethoxyphenyl)methylidene]-1-cyclopentanone CHEMBL498373 SMR000244230 | cid_2407524
Type:
Small organic molecule
Emp. Form.:
C23H24O7
Mol. Mass.:
412.4325
SMILES:
COc1cc(\C=C2/CC\C(=C/c3cc(OC)c(O)c(OC)c3)C2=O)cc(OC)c1O
: