Target
Eukaryotic translation initiation factor 2-alpha kinase 3
Ligand
BDBM46445
Substrate
Meas. Tech.
Dose response cell-based high-throughput screening assay to measure PERK inhibition
EC50
>55700±n/a nM
Citation
 PubChem, PC Dose response cell-based high-throughput screening assay to measure PERK inhibition PubChem Bioassay (2009)[AID] 
Target
Name:
Eukaryotic translation initiation factor 2-alpha kinase 3
Synonyms:
E2AK3_HUMAN HsPEK PERK Pancreatic endoplasmic reticulum kinase (PERK)
Type:
Enzyme
Mol. Mass.:
125190.66
Organism:
Homo sapiens (Human)
Description:
Q9NZJ5
Residue:
1116
  
Inhibitor
Name:
BDBM46445
Synonyms:
MLS000044433 N-tert-butyl-2,1,3-benzothiadiazole-4-sulfonamide SMR000022210 | cid_3236846
Type:
Small organic molecule
Emp. Form.:
C10H13N3O2S2
Mol. Mass.:
271.359
SMILES:
CC(C)(C)NS(=O)(=O)c1cccc2nsnc12
: