Target
Eukaryotic translation initiation factor 2-alpha kinase 3
Ligand
BDBM46463
Substrate
Meas. Tech.
Dose response cell-based high-throughput screening assay to measure PERK inhibition
EC50
>55700±n/a nM
Citation
 PubChem, PC Dose response cell-based high-throughput screening assay to measure PERK inhibition PubChem Bioassay (2009)[AID] 
Target
Name:
Eukaryotic translation initiation factor 2-alpha kinase 3
Synonyms:
E2AK3_HUMAN HsPEK PERK Pancreatic endoplasmic reticulum kinase (PERK)
Type:
Enzyme
Mol. Mass.:
125190.66
Organism:
Homo sapiens (Human)
Description:
Q9NZJ5
Residue:
1116
  
Inhibitor
Name:
BDBM46463
Synonyms:
4-[3-[(2-methoxyethylamino)-oxomethyl]-7-oxo-1H-pyrazolo[1,5-a]pyrimidin-5-yl]-1-piperidinecarboxylic acid tert-butyl ester MLS000522893 cid_9551340 tert-butyl 4-[3-(2-methoxyethylcarbamoyl)-7-oxo-1H-pyrazolo[1,5-a]pyrimidin-5-yl]piperidine-1-carboxylate
Type:
Small organic molecule
Emp. Form.:
C20H29N5O5
Mol. Mass.:
419.4748
SMILES:
COCCNC(=O)c1c[nH]n2c1nc(cc2=O)C1CCN(CC1)C(=O)OC(C)(C)C
: