Target
Eukaryotic translation initiation factor 2-alpha kinase 3
Ligand
BDBM46479
Substrate
Meas. Tech.
Dose response cell-based high-throughput screening assay to measure PERK inhibition
EC50
>55700±n/a nM
Citation
 PubChem, PC Dose response cell-based high-throughput screening assay to measure PERK inhibition PubChem Bioassay (2009)[AID] 
Target
Name:
Eukaryotic translation initiation factor 2-alpha kinase 3
Synonyms:
E2AK3_HUMAN HsPEK PERK Pancreatic endoplasmic reticulum kinase (PERK)
Type:
Enzyme
Mol. Mass.:
125190.66
Organism:
Homo sapiens (Human)
Description:
Q9NZJ5
Residue:
1116
  
Inhibitor
Name:
BDBM46479
Synonyms:
5-[2-(2,5-dimethylphenoxy)ethanoylamino]benzene-1,3-dicarboxylic acid 5-[[2-(2,5-dimethylphenoxy)acetyl]amino]benzene-1,3-dicarboxylic acid 5-{[(2,5-dimethylphenoxy)acetyl]amino}isophthalic acid SMR000299853 | cid_976437
Type:
Small organic molecule
Emp. Form.:
C18H17NO6
Mol. Mass.:
343.3307
SMILES:
Cc1ccc(C)c(OCC(=O)Nc2cc(cc(c2)C(O)=O)C(O)=O)c1
: