Target
Eukaryotic translation initiation factor 2-alpha kinase 3
Ligand
BDBM46476
Substrate
Meas. Tech.
Counterscreen assay for PERK inhibitors: Dose response cell-based high throughput screening assay to measure inhibition of PERK at 6 hours
EC50
>55700±n/a nM
Citation
 PubChem, PC Counterscreen assay for PERK inhibitors: Dose response cell-based high throughput screening assay to measure inhibition of PERK at 6 hours PubChem Bioassay (2009)[AID] 
Target
Name:
Eukaryotic translation initiation factor 2-alpha kinase 3
Synonyms:
E2AK3_HUMAN HsPEK PERK Pancreatic endoplasmic reticulum kinase (PERK)
Type:
Enzyme
Mol. Mass.:
125190.66
Organism:
Homo sapiens (Human)
Description:
Q9NZJ5
Residue:
1116
  
Inhibitor
Name:
BDBM46476
Synonyms:
4-(3-ethoxy-4-hydroxy-phenyl)-N-(4-methoxyphenyl)-6-methyl-2-thioxo-3,4-dihydro-1H-pyrimidine-5-carboxamide 4-(3-ethoxy-4-hydroxyphenyl)-N-(4-methoxyphenyl)-6-methyl-2-thioxo-1,2,3,4-tetrahydropyrimidine-5-carboxamide MLS000705031 cid_2866856
Type:
Small organic molecule
Emp. Form.:
C21H23N3O4S
Mol. Mass.:
413.49
SMILES:
CCOc1cc(ccc1O)C1NC(=S)N=C(C)C1C(=O)Nc1ccc(OC)cc1
: