Target
Transitional endoplasmic reticulum ATPase
Ligand
BDBM46560
Substrate
Meas. Tech.
Luminescence counterscreen assay for p97 inhibitors: Dose response biochemical high throughput screening assay to identify inhibitors of the C522A mutant p97 ATPase.
IC50
>50000±n/a nM
Citation
 PubChem, PC Luminescence counterscreen assay for p97 inhibitors: Dose response biochemical high throughput screening assay to identify inhibitors of the C522A mutant p97 ATPase. PubChem Bioassay (2009)[AID] 
Target
Name:
Transitional endoplasmic reticulum ATPase
Synonyms:
TERA_HUMAN VCP Valosin-containing protein
Type:
Enzyme
Mol. Mass.:
89300.63
Organism:
Homo sapiens (Human)
Description:
P55072
Residue:
806
  
Inhibitor
Name:
BDBM46560
Synonyms:
2-[[4-(2,4-dichlorobenzyl)oxybenzylidene]amino]guanidine MLS000572408 SMR000194367 | cid_2270358
Type:
Small organic molecule
Emp. Form.:
C15H14Cl2N4O
Mol. Mass.:
337.204
SMILES:
[#7]\[#6](-[#7])=[#7]\[#7]=[#6]-c1ccc(-[#8]-[#6]-c2ccc(Cl)cc2Cl)cc1
: