Target
Protein-tyrosine kinase 2-beta
Ligand
BDBM41079
Substrate
Meas. Tech.
TR-FRET counterscreen for FAK inhibitors: dose-response biochemical high throughput screening assay to identify inhibitors of Proline-rich tyrosine kinase 2 (Pyk2)
IC50
8776±n/a nM
Citation
 PubChem, PC TR-FRET counterscreen for FAK inhibitors: dose-response biochemical high throughput screening assay to identify inhibitors of Proline-rich tyrosine kinase 2 (Pyk2) PubChem Bioassay (2009)[AID] 
Target
Name:
Protein-tyrosine kinase 2-beta
Synonyms:
FAK2 PTK2B PTK2B protein tyrosine kinase 2 beta (PTK2B) Protein tyrosine kinase 2 beta | RAFTK
Type:
Protein
Mol. Mass.:
115868.80
Organism:
Homo sapiens (Human)
Description:
Q14289
Residue:
1009
  
Inhibitor
Name:
BDBM41079
Synonyms:
(3Z)-3-(1H-imidazol-5-ylmethylene)oxindole 3-(1H-imidazol-5-ylmethylene)-1,3-dihydro-2H-indol-2-one SMR000180717 | cid_5714572
Type:
Small organic molecule
Emp. Form.:
C12H9N3O
Mol. Mass.:
211.2194
SMILES:
O=C1Nc2ccccc2C1=Cc1cnc[nH]1
: