Target
Broad substrate specificity ATP-binding cassette transporter ABCG2
Ligand
BDBM47375
Substrate
Meas. Tech.
Dose Response for ABC transporter inhibitors: specifically ABCG2 screen, ABCB1 counter-screen
EC50
760±n/a nM
Citation
 PubChem, PC Dose Response for ABC transporter inhibitors: specifically ABCG2 screen, ABCB1 counter-screen PubChem Bioassay (2009)[AID] 
Target
Name:
Broad substrate specificity ATP-binding cassette transporter ABCG2
Synonyms:
ABCG2 ABCP ATP-binding cassette sub-family G member 2 ATP-binding cassette, sub-family G, member 2 BCRP1 CDw338 Mitoxantrone resistance-associated protein Urate exporter
Type:
Multi-pass membrane protein; monomer or homodimer; disulfide-linked
Mol. Mass.:
72329.48
Organism:
Homo sapiens (Human)
Description:
Q9UNQ0
Residue:
655
  
Inhibitor
Name:
BDBM47375
Synonyms:
N-[(E)-[3-[[4-(4-fluorophenyl)-1-piperazinyl]methyl]-4-methoxyphenyl]methylideneamino]-4-hydroxy-3-methoxybenzamide N-[(E)-[3-[[4-(4-fluorophenyl)piperazin-1-yl]methyl]-4-methoxyphenyl]methylideneamino]-4-hydroxy-3-methoxybenzamide UNM000011096601 | cid_9640944
Type:
Small organic molecule
Emp. Form.:
C27H29FN4O4
Mol. Mass.:
492.542
SMILES:
COc1cc(ccc1O)C(=O)N\N=C\c1ccc(OC)c(CN2CCN(CC2)c2ccc(F)cc2)c1
: