Target
Regulator of G-protein signaling 16
Ligand
BDBM47762
Substrate
Meas. Tech.
Dose respone, multiplexed high-throughput screen for small molecule regulators of RGS family protein interactions, specifically RGS16-Galphao.
EC50
>30000±n/a nM
Citation
 PubChem, PC Dose respone, multiplexed high-throughput screen for small molecule regulators of RGS family protein interactions, specifically RGS16-Galphao. PubChem Bioassay (2009)[AID] 
Target
Name:
Regulator of G-protein signaling 16
Synonyms:
RGS16 RGSR regulator of G-protein signalling 16
Type:
Enzyme Catalytic Domain
Mol. Mass.:
22748.87
Organism:
Homo sapiens (Human)
Description:
gi_156416009
Residue:
202
  
Inhibitor
Name:
BDBM47762
Synonyms:
4-butyl-3-(5-isopropyl-3-thienyl)-1H-1,2,4-triazole-5-thione 4-butyl-3-(5-propan-2-ylthiophen-3-yl)-1H-1,2,4-triazole-5-thione MLS000702831 cid_1767613
Type:
Small organic molecule
Emp. Form.:
C13H19N3S2
Mol. Mass.:
281.44
SMILES:
CCCCn1c(n[nH]c1=S)-c1csc(c1)C(C)C
: