Target
Muscarinic acetylcholine receptor M4
Ligand
BDBM48043
Substrate
Meas. Tech.
Discovery of a Highly Selective in vitro and in vivo M4 Positive Allosteric Modulator(PAM): Analog Potency
EC50
388±n/a nM
Comments
modifies from 0.000388 20220104
Citation
 PubChem, PC Discovery of a Highly Selective in vitro and in vivo M4 Positive Allosteric Modulator(PAM): Analog Potency PubChem Bioassay (2010)[AID] 
Target
Name:
Muscarinic acetylcholine receptor M4
Synonyms:
ACM4_RAT Chrm-4 | Chrm4
Type:
Enzyme Catalytic Domain
Mol. Mass.:
52841.70
Organism:
RAT
Description:
Cholinergic, muscarinic M4 CHRM4 RAT::P08485
Residue:
477
  
Inhibitor
Name:
BDBM48043
Synonyms:
3-amino-4,6-dimethyl-N-p-anisyl-thieno[2,3-b]pyridine-2-carboxamide 3-amino-N-[(4-methoxyphenyl)methyl]-4,6-dimethylthieno[2,3-b]pyridine-2-carboxamide ML108 cid_864492
Type:
Small organic molecule
Emp. Form.:
C18H19N3O2S
Mol. Mass.:
341.427
SMILES:
COc1ccc(CNC(=O)c2sc3nc(C)cc(C)c3c2N)cc1
: