Target
Beta-galactosidase
Ligand
BDBM48084
Substrate
Meas. Tech.
HTS Dose response counterscreen for assays utilizing the enzyme, b-galactosidase
EC50
11300±n/a nM
Citation
 PubChem, PC HTS Dose response counterscreen for assays utilizing the enzyme, b-galactosidase PubChem Bioassay (2009)[AID] 
Target
Name:
Beta-galactosidase
Synonyms:
BGAL_ECOLX Lactase | lacZ
Type:
PROTEIN
Mol. Mass.:
116943.87
Organism:
Escherichia coli
Description:
ChEMBL_215882
Residue:
1029
  
Inhibitor
Name:
BDBM48084
Synonyms:
4-(2,4-Dinitro-naphthalen-1-ylamino)-N-o-tolyl-benzamide 4-[(2,4-dinitro-1-naphthyl)amino]-N-(o-tolyl)benzamide MLS000589348 cid_3777125
Type:
Small organic molecule
Emp. Form.:
C24H18N4O5
Mol. Mass.:
442.4235
SMILES:
Cc1ccccc1NC(=O)c1ccc(Nc2c(cc([N+]([O-])=O)c3ccccc23)[N+]([O-])=O)cc1
: