Target
Beta-galactosidase
Ligand
BDBM48091
Substrate
Meas. Tech.
HTS Dose response counterscreen for assays utilizing the enzyme, b-galactosidase
EC50
1665±n/a nM
Citation
 PubChem, PC HTS Dose response counterscreen for assays utilizing the enzyme, b-galactosidase PubChem Bioassay (2009)[AID] 
Target
Name:
Beta-galactosidase
Synonyms:
BGAL_ECOLX Lactase | lacZ
Type:
PROTEIN
Mol. Mass.:
116943.87
Organism:
Escherichia coli
Description:
ChEMBL_215882
Residue:
1029
  
Inhibitor
Name:
BDBM48091
Synonyms:
2-[[[2-[(2,6-diketo-4,4-dimethyl-cyclohexylidene)methylamino]-3-pyridyl]amino]methylene]-5,5-dimethyl-cyclohexane-1,3-quinone 2-[[[2-[(4,4-dimethyl-2,6-dioxocyclohexylidene)methylamino]pyridin-3-yl]amino]methylidene]-5,5-dimethylcyclohexane-1,3-dione 2-{[(2-{[(4,4-dimethyl-2,6-dioxocyclohexylidene)methyl]amino}pyridin-3-yl)amino]methylene}-5,5-dimethylcyclohexane-1,3-dione SMR000305788 | cid_5243548
Type:
Small organic molecule
Emp. Form.:
C23H27N3O4
Mol. Mass.:
409.4782
SMILES:
[#6]C1([#6])[#6]-[#6](=O)\[#6](=[#6]/[#7]-c2cccnc2-[#7]\[#6]=[#6]-2\[#6](=O)-[#6]C([#6])([#6])[#6]-[#6]-2=O)-[#6](=O)-[#6]1
: