Target
Beta-galactosidase
Ligand
BDBM48092
Substrate
Meas. Tech.
HTS Dose response counterscreen for assays utilizing the enzyme, b-galactosidase
EC50
23550±n/a nM
Citation
 PubChem, PC HTS Dose response counterscreen for assays utilizing the enzyme, b-galactosidase PubChem Bioassay (2009)[AID] 
Target
Name:
Beta-galactosidase
Synonyms:
BGAL_ECOLX Lactase | lacZ
Type:
PROTEIN
Mol. Mass.:
116943.87
Organism:
Escherichia coli
Description:
ChEMBL_215882
Residue:
1029
  
Inhibitor
Name:
BDBM48092
Synonyms:
(5E)-5-[(2-methoxy-5-methyl-phenyl)hydrazinylidene]quinolin-8-one (5E)-5-[(2-methoxy-5-methylphenyl)hydrazinylidene]-8-quinolinone 5-[(E)-(2-methoxy-5-methylphenyl)diazenyl]quinolin-8-ol SMR000312330 | cid_5718132
Type:
Small organic molecule
Emp. Form.:
C17H15N3O2
Mol. Mass.:
293.3199
SMILES:
COc1ccc(C)cc1N=Nc1ccc(O)c2ncccc12
: