Target
Beta-galactosidase
Ligand
BDBM48101
Substrate
Meas. Tech.
HTS Dose response counterscreen for assays utilizing the enzyme, b-galactosidase
EC50
9225±n/a nM
Citation
 PubChem, PC HTS Dose response counterscreen for assays utilizing the enzyme, b-galactosidase PubChem Bioassay (2009)[AID] 
Target
Name:
Beta-galactosidase
Synonyms:
BGAL_ECOLX Lactase | lacZ
Type:
PROTEIN
Mol. Mass.:
116943.87
Organism:
Escherichia coli
Description:
ChEMBL_215882
Residue:
1029
  
Inhibitor
Name:
BDBM48101
Synonyms:
1-benzyl-3-(5-methoxy-2-methyl-phenyl)-7H-purine-2,6-quinone 1-benzyl-3-(5-methoxy-2-methylphenyl)-7H-purine-2,6-dione 3-(5-methoxy-2-methylphenyl)-1-(phenylmethyl)-7H-purine-2,6-dione SMR000459657 | cid_2823195
Type:
Small organic molecule
Emp. Form.:
C20H18N4O3
Mol. Mass.:
362.3819
SMILES:
COc1ccc(C)c(c1)-n1c2nc[nH]c2c(=O)n(Cc2ccccc2)c1=O
: