Target
Estrogen receptor beta
Ligand
BDBM32135
Substrate
Meas. Tech.
Estrogen Receptor-beta Coactivator Binding Inhibitors Dose Response Confirmation
IC50
4957.17±n/a nM
Citation
 PubChem, PC Estrogen Receptor-beta Coactivator Binding Inhibitors Dose Response Confirmation PubChem Bioassay (2007)[AID] 
Target
Name:
Estrogen receptor beta
Synonyms:
ER-beta ESR2_HUMAN Estradiol receptor beta (ERβ) Estrogen receptor (ER beta) Estrogen receptor beta (ER beta) NR3A2 estrogen beta
Type:
Protein
Mol. Mass.:
59238.43
Organism:
Homo sapiens (Human)
Description:
Q92731
Residue:
530
  
Inhibitor
Name:
BDBM32135
Synonyms:
4-[4-(3,4-dihydroxyphenyl)-3H-1,3-thiazol-2-ylidene]cyclohexa-2,5-dien-1-one 4-[4-(3,4-dihydroxyphenyl)-4-thiazolin-2-ylidene]cyclohexa-2,5-dien-1-one MLS000111214 cid_5406370
Type:
Small organic molecule
Emp. Form.:
C15H11NO3S
Mol. Mass.:
285.318
SMILES:
Oc1ccc(cc1)-c1nc(cs1)-c1ccc(O)c(O)c1
: