Target
D(1B) dopamine receptor
Ligand
BDBM48918
Substrate
Meas. Tech.
Allosteric Modulators of D1 Receptors: Dose-dependent Counterscreen
EC50
0.00668±n/a nM
Citation
 PubChem, PC Allosteric Modulators of D1 Receptors: Dose-dependent Counterscreen PubChem Bioassay (2007)[AID] 
Target
Name:
D(1B) dopamine receptor
Synonyms:
D(5) dopamine receptor DOPAMINE D5 DRD1L2 DRD5_HUMAN | dopamine receptor D5
Type:
Protein
Mol. Mass.:
52943.41
Organism:
Homo sapiens (Human)
Description:
P21918
Residue:
477
  
Inhibitor
Name:
BDBM48918
Synonyms:
2-acetoxypropyl(trimethyl)ammonium;chloride 2-acetyloxypropyl(trimethyl)azanium;chloride METHACHOLINE CHLORIDE SMR000059224 | cid_6114
Type:
Small organic molecule
Emp. Form.:
C8H18NO2
Mol. Mass.:
160.2335
SMILES:
CC(C[N+](C)(C)C)OC(C)=O
: