Target
Induced myeloid leukemia cell differentiation protein Mcl-1
Ligand
BDBM50482
Substrate
Meas. Tech.
Dose Response Confirmation for Mcl-1/Noxa Interaction Inhibitors
IC50
767.07211±n/a nM
Citation
 PubChem, PC Dose Response Confirmation for Mcl-1/Noxa Interaction Inhibitors PubChem Bioassay (2008)[AID] 
Target
Name:
Induced myeloid leukemia cell differentiation protein Mcl-1
Synonyms:
BCL2L3 Bcl-2-like protein 3 (Mcl-1) Bcl2-L-3 MCL1 Mcl-1 Myeloid cell leukemia sequence 1 (BCL2-related) | mcl1/EAT
Type:
Membrane; Single-pass membrane protein
Mol. Mass.:
37332.87
Organism:
Homo sapiens (Human)
Description:
Q07820
Residue:
350
  
Inhibitor
Name:
BDBM50482
Synonyms:
(5Z)-5-(3-bromo-4,5-dihydroxy-benzylidene)-2-(p-tolyl)-2-thiazolin-4-one (5Z)-5-[(3-bromo-4,5-dihydroxyphenyl)methylidene]-2-(4-methylphenyl)-4-thiazolone 5-(3-bromo-4,5-dihydroxybenzylidene)-2-(4-methylphenyl)-1,3-thiazol-4(5H)-one SMR000298379 | cid_5730111
Type:
Small organic molecule
Emp. Form.:
C17H12BrNO3S
Mol. Mass.:
390.251
SMILES:
Cc1ccc(cc1)C1=NC(=O)\C(S1)=C\c1cc(O)c(O)c(Br)c1
: