Target
Induced myeloid leukemia cell differentiation protein Mcl-1
Ligand
BDBM33196
Substrate
Meas. Tech.
Dose Response Confirmation for Mcl-1/Noxa Interaction Inhibitors
IC50
2276.162697±n/a nM
Citation
 PubChem, PC Dose Response Confirmation for Mcl-1/Noxa Interaction Inhibitors PubChem Bioassay (2008)[AID] 
Target
Name:
Induced myeloid leukemia cell differentiation protein Mcl-1
Synonyms:
BCL2L3 Bcl-2-like protein 3 (Mcl-1) Bcl2-L-3 MCL1 Mcl-1 Myeloid cell leukemia sequence 1 (BCL2-related) | mcl1/EAT
Type:
Membrane; Single-pass membrane protein
Mol. Mass.:
37332.87
Organism:
Homo sapiens (Human)
Description:
Q07820
Residue:
350
  
Inhibitor
Name:
BDBM33196
Synonyms:
MLS001013472 N-[3-(2-methoxyanilino)-1,4-dioxo-2-naphthalenyl]acetamide N-[3-[(2-methoxyphenyl)amino]-1,4-bis(oxidanylidene)naphthalen-2-yl]ethanamide cid_284927
Type:
Small organic molecule
Emp. Form.:
C19H16N2O4
Mol. Mass.:
336.3413
SMILES:
COc1ccccc1NC1=C(NC(C)=O)C(=O)c2ccccc2C1=O
: